Target
Vascular endothelial growth factor receptor 2
Ligand
BDBM365347
Substrate
Meas. Tech.
VEGFR2 Kinase Assay
IC50
3570±n/a nM
Citation
 Boral, SMalone, TCWang, S Pyridyl benzothiophenes as kinase inhibitors US Patent  US10669265 Publication Date 6/2/2020 
Target
Name:
Vascular endothelial growth factor receptor 2
Synonyms:
CD_antigen=CD309 Fetal liver kinase 1 (FLK-1) KDR Protein-tyrosine kinase receptor Flk-1 VEGFR-2 VEGFR2 Vascular Endothelial Growth Factor Receptor Kinase 2 Vascular endothelial growth factor receptor 2 (KDR) Vascular endothelial growth factor receptor 2 (VEGFR2) Vascular endothelial growth factor receptor-2 (VEGFR-2)
Type:
Receptor Tyrosine Kinase
Mol. Mass.:
151510.97
Organism:
Homo sapiens (Human)
Description:
P35968
Residue:
1356
  
Inhibitor
Name:
BDBM365347
Synonyms:
2-(2-aminopyridin-3-yl)-N-(3- methylphenyl)-1- benzothiophene-5- carboxamide US10669265, Example 48 | US9868726, Example 48
Type:
Small organic molecule
Emp. Form.:
C21H17N3OS
Mol. Mass.:
359.444
SMILES:
Cc1cccc(NC(=O)c2ccc3sc(cc3c2)-c2cccnc2N)c1
: