Target
Cathepsin S
Ligand
BDBM447420
Substrate
Meas. Tech.
Enzyme Inhibition Assay
IC50
2.33±n/a nM
Citation
 Haap, WKuhn, BLuebbers, TPeters, J Pyrrolidine derivatives US Patent  US10689339 Publication Date 6/23/2020 
Target
Name:
Cathepsin S
Synonyms:
CATS_HUMAN Cathepsin S (Cat S) | cathepsin S preproprotein
Type:
Protein
Mol. Mass.:
37507.38
Organism:
Homo sapiens (Human)
Description:
P25774
Residue:
331
  
Inhibitor
Name:
BDBM447420
Synonyms:
(2S,4R)—N-(1-cyanocyclopropyl)-4-(4-(1-methyl-3-(trifluoromethyl)-1H-pyrazol-5-yl)phenylsulfonyl)-1-(1-(trifluoromethyl)cyclopropanecarbonyl)pyrrolidine-2-carboxamide | US10689339, Example 28
Type:
Small organic molecule
Emp. Form.:
C25H23F6N5O4S
Mol. Mass.:
603.537
SMILES:
Cn1nc(cc1-c1ccc(cc1)S(=O)(=O)[C@@H]1C[C@H](N(C1)C(=O)C1(CC1)C(F)(F)F)C(=O)NC1(CC1)C#N)C(F)(F)F
: