Target
Plasma kallikrein
Ligand
BDBM448383
Substrate
Meas. Tech.
Inhibition Assay
Ki
2.00±n/a nM
Citation
 Eckhardt, MGollner, ALangkopf, EWagner, HWiedenmayer, D Heteroaromatic carboxamide derivatives as plasma kallikrein inhibitors US Patent  US10695334 Publication Date 6/30/2020 
Target
Name:
Plasma kallikrein
Synonyms:
Fletcher factor KLKB1 Kallikrein Plasma kallikrein heavy chain Plasma prekallikrein
Type:
Protein
Mol. Mass.:
71391.16
Organism:
Homo sapiens (Human)
Description:
P03952
Residue:
638
  
Inhibitor
Name:
BDBM448383
Synonyms:
1-[(6-{3-Azabicyclo[3.1.0]hexan-3-yl}-2-methylpyridin-3-yl)methyl]-3-chloro-N-[(6R)-3-methyl-1H,4H,5H,6H-cyclopenta[c]pyrazol-6-yl]-1H-pyrazole-4-carboxamide | US10695334, Example 12
Type:
Small organic molecule
Emp. Form.:
C23H26ClN7O
Mol. Mass.:
451.952
SMILES:
Cc1n[nH]c2[C@@H](CCc12)NC(=O)c1cn(Cc2ccc(nc2C)N2CC3CC3C2)nc1Cl
: