Target
ALK tyrosine kinase receptor
Ligand
BDBM448440
Substrate
Meas. Tech.
Inhibition Assay
IC50
5.5±n/a nM
Citation
 Wang, XXu, YSheng, XZhang, XXia, HYang, ZYue, YHuang, LXiao, Q Pyrimidine derivative and use thereof US Patent  US10695347 Publication Date 6/30/2020 
Target
Name:
ALK tyrosine kinase receptor
Synonyms:
ALK ALK_HUMAN CD_antigen: CD246
Type:
Protein
Mol. Mass.:
176453.10
Organism:
Homo sapiens (Human)
Description:
Q9UM73
Residue:
1620
  
Inhibitor
Name:
BDBM448440
Synonyms:
US10695347, Compound I-6
Type:
Small organic molecule
Emp. Form.:
C26H34ClN7O3S
Mol. Mass.:
560.111
SMILES:
COc1cc(ccc1Nc1ncc(Cl)c(Nc2cccnc2S(=O)(=O)C(C)C)n1)N1CCC(CC1)N(C)C
: