Target
Glucagon-like peptide 1 receptor
Ligand
BDBM450632
Substrate
Meas. Tech.
CHO GLP-1R Clone C6 Assay 2
EC50
1600±n/a nM
Citation
 Aspnes, GEBagley, SWCurto, JMEdmonds, DJFlanagan, MEFutatsugi, KGriffith, DAHuard, KLian, YLimberakis, CLondregan, ATMathiowetz, AMPiotrowski, DWRuggeri, RB GLP-1 receptor agonists and uses thereof US Patent  US10676465 Publication Date 6/9/2020 
Target
Name:
Glucagon-like peptide 1 receptor
Synonyms:
GLP-1 receptor GLP-1R GLP1R_HUMAN Glucagon-like peptide 1 receptor (GLP-1)
Type:
Enzyme
Mol. Mass.:
53035.78
Organism:
Homo sapiens (Human)
Description:
P43220
Residue:
463
  
Inhibitor
Name:
BDBM450632
Synonyms:
US10676465, Example 9
Type:
Small organic molecule
Emp. Form.:
C33H31FN4O5
Mol. Mass.:
582.6214
SMILES:
C[C@@]1(Oc2cccc(C3CCN(Cc4nc5ccc(cc5n4C[C@@H]4CCO4)C(O)=O)CC3)c2O1)c1ccc(cc1F)C#N
: