Target
von Hippel-Lindau disease tumor suppressor
Ligand
BDBM454870
Substrate
Meas. Tech.
Fluorescence Polarization Assay (1% DMSO)
IC50
539±n/a nM
Citation
 Crew, APCrews, CMChen, XDong, HFerraro, CQian, YSiu, KWang, JJin, MBerlin, MZimmermann, KSnyder, L Compounds and methods for the enhanced degradation of targeted proteins US Patent  US10730870 Publication Date 8/4/2020 
Target
Name:
von Hippel-Lindau disease tumor suppressor
Synonyms:
Protein G7 VHL_HUMAN Von Hippel-Lindau disease tumor suppressor protein (VBC) | pVHL
Type:
Protein
Mol. Mass.:
24136.87
Organism:
Homo sapiens (Human)
Description:
P40337
Residue:
213
  
Inhibitor
Name:
BDBM454870
Synonyms:
US10730870, Example 33 | US11512083, Example 33
Type:
Small organic molecule
Emp. Form.:
C29H31FN4O4S
Mol. Mass.:
550.644
SMILES:
CC(C)[C@H](N1Cc2c(cccc2F)C1=O)C(=O)N1C[C@H](O)C[C@H]1C(=O)NCc1ccc(cc1)-c1scnc1C
: