Target
Mitogen-activated protein kinase kinase kinase kinase 4
Ligand
BDBM225898
Substrate
Meas. Tech.
MAP4K4 Inhibition Assay
IC50
65.6±n/a nM
Citation
 Chen, HCrawford, THarris, SFMagnuson, SRNdubaku, CWang, L Aminoquinazoline and pyridopyrimidine derivatives US Patent  US9592235 Publication Date 3/14/2017 
Target
Name:
Mitogen-activated protein kinase kinase kinase kinase 4
Synonyms:
HGK KIAA0687 MAP4K4 MAPK/ERK kinase kinase kinase 4 MEKKK 4 NIK | Nck-interacting kinase
Type:
Serine/threonine-protein kinase
Mol. Mass.:
142114.73
Organism:
Homo sapiens (Human)
Description:
O95819
Residue:
1239
  
Inhibitor
Name:
BDBM225898
Synonyms:
MAP16 US9855269, Compound 95
Type:
Small Organic Molecule
Emp. Form.:
C17H18N6
Mol. Mass.:
306.365
SMILES:
Nc1ncnc2ccc(nc12)N1CCC(Cc2ccccn2)C1
: