Target
Protein Wnt-3a
Ligand
BDBM300597
Substrate
Meas. Tech.
HCT116 FOPFlash
IC50
>50000±n/a nM
Comments
0.000 12/22/2021
Citation
 Thede, KScott, WBender, EGolz, SHägebarth, ALienau, PPuehler, FBasting, DSchneider, DMöwes, MRichter, AZorn, LLiu, NMönning, USiegel, F Compounds US Patent  US10130633 Publication Date 11/20/2018 
Target
Name:
Protein Wnt-3a
Synonyms:
WNT3A | WNT3A_HUMAN
Type:
PROTEIN
Mol. Mass.:
39379.02
Organism:
Homo sapiens (Human)
Description:
ChEMBL_1469237
Residue:
352
  
Inhibitor
Name:
BDBM300597
Synonyms:
3-{[(2,4-dimethylpiperazin-1-yl)acetyl]amino}-N-(5-phenyl-1,3,4-thiadiazol-2-yl)-4-(trifluoromethoxy)benzamide | US10130633, Example 167
Type:
Small organic molecule
Emp. Form.:
C24H25F3N6O3S
Mol. Mass.:
534.554
SMILES:
CC1CN(C)CCN1CC(=O)Nc1cc(ccc1OC(F)(F)F)C(=O)Nc1nnc(s1)-c1ccccc1
: