Target
Cyclin-dependent kinase 4/G1/S-specific cyclin-D1
Ligand
BDBM7610
Substrate
GST-Rb fusion protein
Meas. Tech.
CDK Assay
pH
7±n/a
Temperature
295.15±n/a K
IC50
19000±n/a nM
Citation
 Breault, GAEllston, RPGreen, SJames, SRJewsbury, PJMidgley, CJPauptit, RAMinshull, CATucker, JAPease, JE Cyclin-dependent kinase 4 inhibitors as a treatment for cancer. Part 2: identification and optimisation of substituted 2,4-bis anilino pyrimidines. Bioorg Med Chem Lett 13:2961-6 (2003)  
Target
Name:
Cyclin-dependent kinase 4/G1/S-specific cyclin-D1
Synonyms:
CDK4/CycD CDK4/Cyclin D1 Cyclin-Dependent Kinase 4 (CDK4) Cyclin-dependent kinase 4/G1/S-specific cyclin D1 | Cyclin-dependent kinase 4/cyclin D1
Type:
Protein Complex
Mol. Mass.:
Description:
CDK4/D1 complexes were purified from insect cells co-infected with baculovirus vectors containing each of the components.
Components:
This complex has 2 components.
Component 1
Name:
Cyclin-dependent kinase 4
Synonyms:
CDK4 Cell division protein kinase 4 PSK-J3
Type:
Enzyme Subunit
Mol. Mass.:
33731.96
Organism:
Homo sapiens (Human)
Description:
P11802
Residue:
303
  
Component 2
Name:
G1/S-specific cyclin-D1
Synonyms:
B-cell lymphoma 1 protein BCL-1 oncogene CCND1 PRAD1 | PRAD1 oncogene
Type:
Enzyme Subunit
Mol. Mass.:
33717.70
Organism:
Homo sapiens (Human)
Description:
Residue:
295
  
Inhibitor
Name:
BDBM7610
Synonyms:
2,4-bis anilino pyrimidine deriv. 6 | 2-N-{4-[3-(dimethylamino)-2-hydroxypropoxy]phenyl}-4-N-(2-methoxyphenyl)pyrimidine-2,4-diamine
Type:
Small organic molecule
Emp. Form.:
C22H27N5O3
Mol. Mass.:
409.4815
SMILES:
COc1ccccc1Nc1ccnc(Nc2ccc(OCC(O)CN(C)C)cc2)n1
:
Substrate
Name:
GST-Rb fusion protein
Synonyms:
Glutathione S-transferase (GST)-retinoblastoma (Rb) fusion RB1 Rb | retinoblastoma
Type:
Other Protein Type
Mol. Mass.:
106410.17
Organism:
Homo sapiens (Human)
Description:
GST-60 kDa Rb fusion protein (comprising amino acids 378 to 928 of retinoblastoma)
Residue:
928