Target
Endothelin-1
Ligand
BDBM169492
Substrate
Meas. Tech.
ET-1 Assay
EC50
>200000±n/a nM
Citation
 PubChem, PCBuckman, BONicholas, JBRamphal, JYEmayan, KSeiwert, SD Anti-fibrotic pyridinones US Patent  US9675593 Publication Date 6/13/2017 
Target
Name:
Endothelin-1
Synonyms:
EDN1 PPET1 | Preproendothelin-1
Type:
Protein
Mol. Mass.:
24444.51
Organism:
Homo sapiens (Human)
Description:
P05305
Residue:
212
  
Inhibitor
Name:
BDBM169492
Synonyms:
US9675593, 181
Type:
Small organic molecule
Emp. Form.:
C18H13ClFNO
Mol. Mass.:
313.753
SMILES:
Cc1cc(=O)n(cc1-c1ccc(F)cc1)-c1ccc(Cl)cc1
: