Target
Cyclin-A2/Cyclin-dependent kinase 2
Ligand
BDBM7739
Substrate
Peptide Substrate
Meas. Tech.
Kinase Inhibition SPA Assay
IC50
4.6±n/a nM
Citation
 Bramson, HNCorona, JDavis, STDickerson, SHEdelstein, MFrye, SVGampe, RTHarris, PAHassell, AHolmes, WDHunter, RNLackey, KELovejoy, BLuzzio, MJMontana, VRocque, WJRusnak, DShewchuk, LVeal, JMWalker, DHKuyper, LF Oxindole-based inhibitors of cyclin-dependent kinase 2 (CDK2): design, synthesis, enzymatic activities, and X-ray crystallographic analysis. J Med Chem 44:4339-58 (2001)  
Target
Name:
Cyclin-A2/Cyclin-dependent kinase 2
Synonyms:
CDK2-CyclinA CDK2/Cyclin A Cyclin A2/dependent kinase 2 Cyclin-Dependent Kinase 2 (CDK2A)
Type:
Protein Complex
Mol. Mass.:
Description:
Cdk2/Cyclin A kinase was purified from insect cells coinfected with Cyclin A/Cdk2 baculovirus.
Components:
This complex has 2 components.
Component 1
Name:
Cyclin-dependent kinase 2
Synonyms:
CDK2 CDK2_HUMAN Cell division protein kinase 2 Protein cereblon/Cyclin-dependent kinase 2 | p33 protein kinase
Type:
Enzyme Subunit
Mol. Mass.:
33938.17
Organism:
Homo sapiens (Human)
Description:
P24941
Residue:
298
  
Component 2
Name:
Cyclin-A2
Synonyms:
CCN1 CCNA1 CCNA2_HUMAN Cyclin-A
Type:
Enzyme Subunit
Mol. Mass.:
48550.19
Organism:
Homo sapiens (Human)
Description:
P20248
Residue:
432
  
Inhibitor
Name:
BDBM7739
Synonyms:
4-[2-(4-Methyl-5-nitro-2-oxo-1,2-dihydro-3H-indol-3-ylidene)hydrazino]benzenesulfonamide Oxindole-Based Inhibitor 75
Type:
Small organic molecule
Emp. Form.:
C15H13N5O5S
Mol. Mass.:
375.359
SMILES:
Cc1c2C(=NNc3ccc(cc3)S(N)(=O)=O)C(=O)Nc2ccc1N(=O)=O
:
Substrate
Name:
Peptide Substrate
Synonyms:
Type:
Peptide
Mol. Mass.:
5198.94
Organism:
Description:
Residue:
46