BDBM101904 CHEMBL2147972::US8530490, 176
SMILES CC(C)(NS(=O)(=O)c1ccccc1)c1ccc(Cn2ccc(=O)[nH]c2=O)cc1
InChI Key InChIKey=GCOVIPRZHPHWAC-UHFFFAOYSA-N
Data  2 IC50  1 EC50
  Tab Delimited (TSV)   2D SDfile   Computed 3D by Vconf -m prep SDfile
Find this compound or compounds like it in BindingDB:
Activity Spreadsheet -- Enzyme Inhibition Constant Data from BindingDB
Found 3 hits for monomerid = 101904
TargetDeoxyuridine 5'-triphosphate nucleotidohydrolase, mitochondrial(Homo sapiens (Human))
Taiho Pharmaceutical
US Patent
LigandPNGBDBM101904(CHEMBL2147972 | US8530490, 176)
Affinity DataIC50:  2.69E+3nM. Assay description: The inhibitory activity of the compound against human dUTPase was determined by measuring the production of [5-3H]deoxyuridine monophosphate from [5-...
In DepthDetails US Patent
TargetDeoxyuridine 5'-triphosphate nucleotidohydrolase, mitochondrial(Homo sapiens (Human))
Taiho Pharmaceutical
US Patent
LigandPNGBDBM101904(CHEMBL2147972 | US8530490, 176)
Affinity DataIC50:  1.80E+3nM. Assay description: Inhibition of human dUTPase-mediated formation of [5-3H]dUMP expressed in Escherichia coli BL21 (DE3) after 15 mins by HPLC analysis
In DepthDetails ArticlePubMed
TargetDeoxyuridine 5'-triphosphate nucleotidohydrolase, mitochondrial(Homo sapiens (Human))
Taiho Pharmaceutical
US Patent
LigandPNGBDBM101904(CHEMBL2147972 | US8530490, 176)
Affinity DataEC50:  2.60E+3nM. Assay description: Inhibition of human dUTPase-mediated cell proliferation in HeLa S3 cells assessed as compound concentration required to reduce 50% of 1 uM of FdUrd T...
In DepthDetails ArticlePubMed