BDBM10308 5-(azetidine-1-sulfonyl)-2,3-dihydro-1H-indole-2,3-dione::5-[1-(Azetidinyl)sulfonyl]isatin::Isatin Sulfonamide 19
SMILES O=C1Nc2ccc(cc2C1=O)S(=O)(=O)N1CCC1
InChI Key InChIKey=VEHTUFDNCGHBFH-UHFFFAOYSA-N
Data  2 IC50
  Tab Delimited (TSV)   2D SDfile   Computed 3D by Vconf -m prep SDfile
Find this compound or compounds like it in BindingDB:
Activity Spreadsheet -- Enzyme Inhibition Constant Data from BindingDB
Found 2 hits for monomerid = 10308
TargetCaspase-3(Homo sapiens (Human))
Osmania University College For Women
Curated by ChEMBL
LigandPNGBDBM10308(5-(azetidine-1-sulfonyl)-2,3-dihydro-1H-indole-2,3...)
Affinity DataIC50:  170nM. Assay description: Inhibition of caspase 3 in human SK-N-SH cells assessed as accumulation of fluorogenic 7-amino-4-methyl coumarin by flurometric assay
In DepthDetails ArticlePubMed
TargetCaspase-3(Homo sapiens (Human))
Osmania University College For Women
Curated by ChEMBL
LigandPNGBDBM10308(5-(azetidine-1-sulfonyl)-2,3-dihydro-1H-indole-2,3...)
Affinity DataIC50:  170nMpH: 7.5 T: 2°C. Assay description: The substrate peptides terminating in AMC/AFC are processed by caspases with or without inhibitors, and the accumulation of AMC/AFC was assessed with...
In DepthDetails ArticlePubMed