BDBM104124 US8575145, 1
SMILES C1CC(CCN1)Nc1cccc2ccc(nc12)-c1nnc2ccccn12
InChI Key InChIKey=BIOQJVDMPGUPRM-UHFFFAOYSA-N
Data  3 IC50
  Tab Delimited (TSV)   2D SDfile   Computed 3D by Vconf -m prep SDfile
Find this compound or compounds like it in BindingDB:
Activity Spreadsheet -- Enzyme Inhibition Constant Data from BindingDB
Found 3 hits for monomerid = 104124
TargetSerine/threonine-protein kinase pim-1(Homo sapiens (Human))
Array Biopharma
US Patent
LigandPNGBDBM104124(US8575145, 1)
Affinity DataIC50:  1.60nMpH: 7.4 T: 2°C. Assay description: The assay for the determination of PIM activity is based on the incorporation of [33P] ATP into PIM2tide substrate and capture of the radiolabeled pe...
In DepthDetails US Patent
TargetSerine/threonine-protein kinase pim-3(Rattus norvegicus (Rat))
Array Biopharma
US Patent
LigandPNGBDBM104124(US8575145, 1)
Affinity DataIC50:  4.40nMpH: 7.4 T: 2°C. Assay description: The assay for the determination of PIM activity is based on the incorporation of [33P] ATP into PIM2tide substrate and capture of the radiolabeled pe...
In DepthDetails US Patent
TargetSerine/threonine-protein kinase pim-2(Homo sapiens (Human))
Array Biopharma
US Patent
LigandPNGBDBM104124(US8575145, 1)
Affinity DataIC50:  1.11E+3nMpH: 7.4 T: 2°C. Assay description: The assay for the determination of PIM activity is based on the incorporation of [33P] ATP into PIM2tide substrate and capture of the radiolabeled pe...
In DepthDetails US Patent