BDBM10583 3-Chloro-6,7,10,11-tetrahydro-9-methyl-12-{{6-[(1,2,3,4-tetrahydroacridin-9-yl)amino]hexyl}amino}-7,11-methanocycloocta[b]quinoline dihydrochloride::7-chloro-15-methyl-N-[6-(1,2,3,4-tetrahydroacridin-9-ylamino)hexyl]-10-azatetracyclo[11.3.1.0^{2,11}.0^{4,9}]heptadeca-2(11),3,5,7,9,14-hexaen-3-amine dihydrochloride::CHEMBL2011483::Huprine-Tacrine Heterodimer 17a
SMILES CC1=CC2CC(C1)c1c(C2)nc2cc(Cl)ccc2c1NCCCCCCNc1c2CCCCc2nc2ccccc12
InChI Key InChIKey=HLRVNJVVXBHFTE-UHFFFAOYSA-N
Data  4 IC50
  Tab Delimited (TSV)   2D SDfile   Computed 3D by Vconf -m prep SDfile
Find this compound or compounds like it in BindingDB:
Activity Spreadsheet -- Enzyme Inhibition Constant Data from BindingDB
Found 4 hits for monomerid = 10583
TargetAcetylcholinesterase(Homo sapiens (Human))
Universitat De Barcelona
LigandPNGBDBM10583(3-Chloro-6,7,10,11-tetrahydro-9-methyl-12-{{6-[(1,...)
Affinity DataIC50:  0.5nMpH: 8.0 T: 2°C. Assay description: The cholinesterase assays were performed using colorimetric method reported by Ellman. Enzyme activity was determined by measuring the absorbance at...
In DepthDetails ArticlePubMed
TargetCholinesterase(Homo sapiens (Human))
Universitat De Barcelona
Curated by ChEMBL
LigandPNGBDBM10583(3-Chloro-6,7,10,11-tetrahydro-9-methyl-12-{{6-[(1,...)
Affinity DataIC50:  25nM. Assay description: Inhibition of human serum BChE using butyrylthiocholine iodide as substrate preincubated for 20 mins prior substrate addition measured after 5 mins b...
In DepthDetails ArticlePubMed
TargetAcetylcholinesterase(Homo sapiens (Human))
Universitat De Barcelona
LigandPNGBDBM10583(3-Chloro-6,7,10,11-tetrahydro-9-methyl-12-{{6-[(1,...)
Affinity DataIC50:  0.890nM. Assay description: Inhibition of human recombinant AChE using acetylthiocholine iodide as substrate preincubated for 20 mins prior substrate addition measured after 5 m...
In DepthDetails ArticlePubMed
TargetCholinesterase(Homo sapiens (Human))
Universitat De Barcelona
Curated by ChEMBL
LigandPNGBDBM10583(3-Chloro-6,7,10,11-tetrahydro-9-methyl-12-{{6-[(1,...)
Affinity DataIC50:  7.69nM. Assay description: The cholinesterase assays were performed using colorimetric method reported by Ellman. Enzyme activity was determined by measuring the absorbance at...
In DepthDetails ArticlePubMed