BDBM10586 3-Chloro-6,7,10,11-tetrahydro-9-methyl-12-{{3-{N-{3-[(1,2,3,4-tetrahydroacridin-9-yl)amino]propyl}-N-methylamino}propyl}amino}-7,11-methanocycloocta[b]quinoline trihydrochloride::CHEMBL2011487::Huprine-Tacrine Heterodimer 17d::[3-({7-chloro-15-methyl-10-azatetracyclo[11.3.1.0^{2,11}.0^{4,9}]heptadeca-2(11),3,5,7,9,14-hexaen-3-yl}amino)propyl](methyl)[3-(1,2,3,4-tetrahydroacridin-9-ylamino)propyl]amine trihydrochloride
SMILES CN(CCCNc1c2CCCCc2nc2ccccc12)CCCNc1c2C3CC(Cc2nc2cc(Cl)ccc12)C=C(C)C3
InChI Key InChIKey=YFDJQAZBRSGJIT-UHFFFAOYSA-N
Data  4 IC50
  Tab Delimited (TSV)   2D SDfile   Computed 3D by Vconf -m prep SDfile
Find this compound or compounds like it in BindingDB:
Activity Spreadsheet -- Enzyme Inhibition Constant Data from BindingDB
Found 4 hits for monomerid = 10586
TargetAcetylcholinesterase(Homo sapiens (Human))
Universitat De Barcelona
LigandPNGBDBM10586(3-Chloro-6,7,10,11-tetrahydro-9-methyl-12-{{3-{N-{...)
Affinity DataIC50:  0.320nMpH: 8.0 T: 2°C. Assay description: The cholinesterase assays were performed using colorimetric method reported by Ellman. Enzyme activity was determined by measuring the absorbance at...
In DepthDetails ArticlePubMed
TargetCholinesterase(Homo sapiens (Human))
Universitat De Barcelona
Curated by ChEMBL
LigandPNGBDBM10586(3-Chloro-6,7,10,11-tetrahydro-9-methyl-12-{{3-{N-{...)
Affinity DataIC50:  44nM. Assay description: Inhibition of human serum BChE using butyrylthiocholine iodide as substrate preincubated for 20 mins prior substrate addition measured after 5 mins b...
In DepthDetails ArticlePubMed
TargetAcetylcholinesterase(Homo sapiens (Human))
Universitat De Barcelona
LigandPNGBDBM10586(3-Chloro-6,7,10,11-tetrahydro-9-methyl-12-{{3-{N-{...)
Affinity DataIC50:  0.420nM. Assay description: Inhibition of human recombinant AChE using acetylthiocholine iodide as substrate preincubated for 20 mins prior substrate addition measured after 5 m...
In DepthDetails ArticlePubMed
TargetCholinesterase(Homo sapiens (Human))
Universitat De Barcelona
Curated by ChEMBL
LigandPNGBDBM10586(3-Chloro-6,7,10,11-tetrahydro-9-methyl-12-{{3-{N-{...)
Affinity DataIC50:  16.4nM. Assay description: The cholinesterase assays were performed using colorimetric method reported by Ellman. Enzyme activity was determined by measuring the absorbance at...
In DepthDetails ArticlePubMed