BDBM106264 US9695175, 11
SMILES Cn1cc2c(F)c(ccc2n1)C(F)(F)c1nnc2ccc(nn12)-c1cncc(Cl)c1
InChI Key InChIKey=WHECOYUCHOYFMI-UHFFFAOYSA-N
Data  1 IC50
  Tab Delimited (TSV)   2D SDfile   Computed 3D by Vconf -m prep SDfile
Find this compound or compounds like it in BindingDB:
Activity Spreadsheet -- Enzyme Inhibition Constant Data from BindingDB
Found 1 hit for monomerid = 106264
TargetHepatocyte growth factor receptor [1038-1346](Homo sapiens (Human))
Cb Therapeutics
US Patent
LigandPNGBDBM106264(US9695175, 11)
Affinity DataIC50:  194nMT: 2°C. Assay description: Optiplate-384 well plate (PerKinElmer), kinase buffer (50 mM Hepes pH7.5, 25 mM NaCl, 2 mM DTT, 0.01% Tween 20, 5 mM Mg2+, 0.5 mM Mn2+), c-Met kinase...
In DepthDetails US Patent