BDBM106336 US9695175, 23
SMILES CC(C)NC(=O)c1ccc(cc1F)-c1ccc2nnc(n2n1)C(F)(F)c1cc2cn(C)nc2cc1F
InChI Key InChIKey=RYJDVCTZTGREGZ-UHFFFAOYSA-N
Data  1 IC50
  Tab Delimited (TSV)   2D SDfile   Computed 3D by Vconf -m prep SDfile
Find this compound or compounds like it in BindingDB:
Activity Spreadsheet -- Enzyme Inhibition Constant Data from BindingDB
Found 1 hit for monomerid = 106336
TargetHepatocyte growth factor receptor [1038-1346](Homo sapiens (Human))
Cb Therapeutics
US Patent
LigandPNGBDBM106336(US9695175, 23)
Affinity DataIC50:  42nMT: 2°C. Assay description: Optiplate-384 well plate (PerKinElmer), kinase buffer (50 mM Hepes pH7.5, 25 mM NaCl, 2 mM DTT, 0.01% Tween 20, 5 mM Mg2+, 0.5 mM Mn2+), c-Met kinase...
In DepthDetails US Patent