BDBM107002 US8592579, 107
SMILES C[C@]1(CCCN1c1nc(Nc2cc(n[nH]2)C2CC2)c2cccn2n1)C(=O)Nc1ncc(Cl)s1
InChI Key InChIKey=QWYVEQOENADKMY-NRFANRHFSA-N
Data  1 IC50
  Tab Delimited (TSV)   2D SDfile   Computed 3D by Vconf -m prep SDfile
Find this compound or compounds like it in BindingDB:
Activity Spreadsheet -- Enzyme Inhibition Constant Data from BindingDB
Found 1 hit for monomerid = 107002
TargetInsulin-like growth factor 1 receptor(Homo sapiens (Human))
Bristol-Myers Squibb
US Patent
LigandPNGBDBM107002(US8592579, 107)
Affinity DataIC50:  16nMpH: 7.4Assay Description:Kinase assay using IGF1-receptor.
In DepthDetails US Patent