BDBM107155 US8592426, 4
SMILES Cc1nc(no1)-c1c(F)cc(Cl)cc1-c1ccc2C(CCc2c1)NC(=O)C1(CC1)NC(=O)C(F)(F)F
InChI Key InChIKey=CIQDQPSLIUICPX-UHFFFAOYSA-N
Data  1 KI  1 IC50
  Tab Delimited (TSV)   2D SDfile   Computed 3D by Vconf -m prep SDfile
Find this compound or compounds like it in BindingDB:
Activity Spreadsheet -- Enzyme Inhibition Constant Data from BindingDB
Found 2 hits for monomerid = 107155
TargetKininogen-1(Homo sapiens (Human))
Hoffmann-La Roche
US Patent
LigandPNGBDBM107155(US8592426, 4)
Affinity DataKi:  20.2nM. Assay description: Binding assay using Bradykinin-1 receptor.
In DepthDetails US Patent
TargetKininogen-1(Homo sapiens (Human))
Hoffmann-La Roche
US Patent
LigandPNGBDBM107155(US8592426, 4)
Affinity DataIC50:  2nM. Assay description: Calcium mobilization assay using Bradykinin-1 receptor.
In DepthDetails US Patent