BDBM107751 CHEMBL2089063::US8598217, 89
SMILES CN(C)C1CCN(CC1)c1ccc2nc([nH]c2c1)C(=O)c1ccnc(c1)-c1cncc2ccccc12
InChI Key InChIKey=POJGZHZSQVZDGP-UHFFFAOYSA-N
Data  3 IC50
  Tab Delimited (TSV)   2D SDfile   Computed 3D by Vconf -m prep SDfile
Find this compound or compounds like it in BindingDB:
Activity Spreadsheet -- Enzyme Inhibition Constant Data from BindingDB
Found 3 hits for monomerid = 107751
TargetCyclin-dependent kinase 4(Oryctolagus cuniculus (Rabbit))
Astex Therapeutics
US Patent
LigandPNGBDBM107751(CHEMBL2089063 | US8598217, 89)
Affinity DataIC50:  4nMpH: 7.5Assay Description:A 384-well microtiter Lance TR-FRET (time-resolved-fluorescence energy transfer) endpoint assay was used for CDK4/cyclin D1 kinase activity measureme...
In DepthDetails US Patent
TargetCyclin-dependent kinase/G2/mitotic-specific cyclin- 1(Homo sapiens (Human))
TBA
Curated by ChEMBL
LigandPNGBDBM107751(CHEMBL2089063 | US8598217, 89)
Affinity DataIC50:  1.20E+3nM. Assay description: Inhibition of human CDK1/cyclin B assessed as inhibition of Tamra-H1 phosphorylation by IMAP-FP assay
In DepthDetails ArticlePubMed
TargetCyclin-dependent kinase 6/G1/S-specific cyclin-D3(Homo sapiens (Human))
TBA
Curated by ChEMBL
LigandPNGBDBM107751(CHEMBL2089063 | US8598217, 89)
Affinity DataIC50:  49nM. Assay description: Inhibition of human CDK6/cyclin D3 assessed as inhibition of pRb Ser780 phosphorylation after 120 mins by TR-FRET assay
In DepthDetails ArticlePubMed