BDBM108277 US8604046, 57
SMILES CC1CCCN1C1CCN(C1)c1ccc(N2CCC3(CCN(CC3)C(=O)c3ccc(OC(F)(F)F)cc3)C2=O)c(C)c1
InChI Key InChIKey=BFYZNAOKDWKLBO-UHFFFAOYSA-N
Data  1 KI
  Tab Delimited (TSV)   2D SDfile   Computed 3D by Vconf -m prep SDfile
Find this compound or compounds like it in BindingDB:
Activity Spreadsheet -- Enzyme Inhibition Constant Data from BindingDB
Found 1 hit for monomerid = 108277
TargetHistamine H3 receptor(Macaca mulatta (Rhesus macaque))
Sanofi
US Patent
LigandPNGBDBM108277(US8604046, 57)
Affinity DataKi:  6.20nM. Assay description: The compounds of this invention have been demonstrated to displace [3H]- methylhistamine radioligand binding to mammalian cell membranes expressing r...
In DepthDetails US Patent