BDBM108293 US8604046, 73
SMILES C[C@H]1CCCN1[C@H]1CCN(C1)c1ccc(cc1)N1CCCC2(CCN(CC3CC3)CC2)C1=O
InChI Key InChIKey=XJXJPAVAMSBCQC-NVQXNPDNSA-N
Data  1 KI
  Tab Delimited (TSV)   2D SDfile   Computed 3D by Vconf -m prep SDfile
Find this compound or compounds like it in BindingDB:
Activity Spreadsheet -- Enzyme Inhibition Constant Data from BindingDB
Found 1 hit for monomerid = 108293
TargetHistamine H3 receptor(Macaca mulatta (Rhesus macaque))
Sanofi
US Patent
LigandPNGBDBM108293(US8604046, 73)
Affinity DataKi:  0.200nM. Assay description: The compounds of this invention have been demonstrated to displace [3H]- methylhistamine radioligand binding to mammalian cell membranes expressing r...
In DepthDetails US Patent