BDBM108325 US8604046, 105
SMILES C[C@H]1CCCN1[C@H]1CCN(C1)c1ccc(N2CCC3(CCN(Cc4ccco4)CC3)C2=O)c(c1)C(F)(F)F
InChI Key InChIKey=SAKZWHDDNTUCCS-GMAHTHKFSA-N
Data  1 KI
  Tab Delimited (TSV)   2D SDfile   Computed 3D by Vconf -m prep SDfile
Find this compound or compounds like it in BindingDB:
Activity Spreadsheet -- Enzyme Inhibition Constant Data from BindingDB
Found 1 hit for monomerid = 108325
TargetHistamine H3 receptor(Macaca mulatta (Rhesus macaque))
Sanofi
US Patent
LigandPNGBDBM108325(US8604046, 105)
Affinity DataKi:  5.5nM. Assay description: The compounds of this invention have been demonstrated to displace [3H]- methylhistamine radioligand binding to mammalian cell membranes expressing r...
Ligand InfoPC cidPC sid
In DepthDetails US Patent