BDBM108327 US8604046, 107
SMILES C[C@H]1CCCN1[C@H]1CCN(C1)c1ccc(N2CCC3(CCN(CC4CCOCC4)CC3)C2=O)c(c1)C(F)(F)F
InChI Key InChIKey=CXKLHZUCDRRWFU-DHLKQENFSA-N
Data  1 KI
  Tab Delimited (TSV)   2D SDfile   Computed 3D by Vconf -m prep SDfile
Find this compound or compounds like it in BindingDB:
Activity Spreadsheet -- Enzyme Inhibition Constant Data from BindingDB
Found 1 hit for monomerid = 108327
TargetHistamine H3 receptor(Macaca mulatta (Rhesus macaque))
Sanofi
US Patent
LigandPNGBDBM108327(US8604046, 107)
Affinity DataKi:  4.20nM. Assay description: The compounds of this invention have been demonstrated to displace [3H]- methylhistamine radioligand binding to mammalian cell membranes expressing r...
In DepthDetails US Patent