BDBM118842 US8674113, 99
SMILES Cn1c(Nc2c(Cl)ccc(CNC(=O)C(C)(C)C)c2Cl)nc2cc(C(=O)N[C@H]3CC[C@@H](CC3)C(F)(F)F)c(cc12)N1CC(C1)OC(F)F
InChI Key InChIKey=AFBZWBYHPOHKGP-IYARVYRRSA-N
Data  1 IC50
  Tab Delimited (TSV)   2D SDfile   Computed 3D by Vconf -m prep SDfile
Find this compound or compounds like it in BindingDB:
Activity Spreadsheet -- Enzyme Inhibition Constant Data from BindingDB
Found 1 hit for monomerid = 118842
TargetProstaglandin E synthase(Homo sapiens (Human))
Boehringer Ingelheim International
US Patent
LigandPNGBDBM118842(US8674113, 99)
Affinity DataIC50:  1nMpH: 7.4 T: 2°C. Assay description: The aim of this assay is to determine the affinity of a test compound for the mPGES-1 enzyme. 47 μl of recombinant human mPGES-1 (0.5 μg p...
In DepthDetails US Patent