BDBM119953 US8697911, 112
SMILES CN1CCc2nc(NC(=O)c3cccc(CNC(=O)c4ccc(s4)-c4ccncc4)c3)sc2C1
InChI Key InChIKey=KMUVLUVUPGWIHJ-UHFFFAOYSA-N
Data  1 IC50
  Tab Delimited (TSV)   2D SDfile   Computed 3D by Vconf -m prep SDfile
Find this compound or compounds like it in BindingDB:
Activity Spreadsheet -- Enzyme Inhibition Constant Data from BindingDB
Found 1 hit for monomerid = 119953
TargetRho-associated protein kinase 2(Homo sapiens (Human))
Boehringer Ingelheim International
US Patent
LigandPNGBDBM119953(US8697911, 112)
Affinity DataIC50:  0.180nMpH: 7.2Assay Description:This assay is performed using FAM S6 substrate peptide (Catalogue #R7184) and IMAP FP Screening Express Kit detection reagents from Molecular Devices...
In DepthDetails US Patent