BDBM121277 US8722896, (+/-)-4-(Indolin-4-ylmethyl)-N-(9- chloro-3,4-dihydro-2H-1,5- benzodioxepin-7-ylmethyl)-N- isobutylmorpholine-2- carboxamide
SMILES CC(C)CN(Cc1cc(Cl)c2OCCCOc2c1)C(=O)C1CN(Cc2cccc3NCCc23)CCO1
InChI Key InChIKey=IWXKVCFQGOWIFS-UHFFFAOYSA-N
Data  2 KI
  Tab Delimited (TSV)   2D SDfile   Computed 3D by Vconf -m prep SDfile
Find this compound or compounds like it in BindingDB:
Activity Spreadsheet -- Enzyme Inhibition Constant Data from BindingDB
Found 2 hits for monomerid = 121277
TargetProkineticin receptor 2(Cricetulus griseus (Chinese hamster))
The Regents of The University of California
US Patent
LigandPNGBDBM121277(US8722896, (+/-)-4-(Indolin-4-ylmethyl)-N-(9- chlo...)
Affinity DataKi:  2.64nM ΔG°:  -12.2kcal/moleT: 2°C. Assay description: An aequorin-based luminescent assay for calcium mobilization was used to measure mobilization of intracellular Ca2+ (Bullock et al., Mol Pharmacol 65...
In DepthDetails US Patent
TargetProkineticin receptor 1(Cricetulus griseus (Chinese hamster))
The Regents of The University of California
US Patent
LigandPNGBDBM121277(US8722896, (+/-)-4-(Indolin-4-ylmethyl)-N-(9- chlo...)
Affinity DataKi:  4.80nM ΔG°:  -11.8kcal/moleT: 2°C. Assay description: An aequorin-based luminescent assay for calcium mobilization was used to measure mobilization of intracellular Ca2+ (Bullock et al., Mol Pharmacol 65...
In DepthDetails US Patent