BDBM121299 US8722896, (+/-)-2-Methyl-3-(N-methyl-indol- 4-ylmethylamino)-N-(9-chloro- 2,3,4,5-tetrahydro-1-benzoxepin- 7-ylmethyl)-N- isobutylpropanamide
SMILES CC(C)CN(Cc1cc(Cl)c2OCCCCc2c1)C(=O)C(C)CNCc1cccc2n(C)ccc12
InChI Key InChIKey=MPKIZEXUUBTYCR-UHFFFAOYSA-N
Data  3 KI
  Tab Delimited (TSV)   2D SDfile   Computed 3D by Vconf -m prep SDfile
Find this compound or compounds like it in BindingDB:
Activity Spreadsheet -- Enzyme Inhibition Constant Data from BindingDB
Found 3 hits for monomerid = 121299
TargetProkineticin receptor 1(Cricetulus griseus (Chinese hamster))
The Regents of The University of California
US Patent
LigandPNGBDBM121299(US8722896, (+/-)-2-Methyl-3-(N-methyl-indol- 4-ylm...)
Affinity DataKi:  4.5nM ΔG°:  -11.8kcal/moleT: 2°C. Assay description: An aequorin-based luminescent assay for calcium mobilization was used to measure mobilization of intracellular Ca2+ (Bullock et al., Mol Pharmacol 65...
In DepthDetails US Patent
TargetProkineticin receptor 1(Cricetulus griseus (Chinese hamster))
The Regents of The University of California
US Patent
LigandPNGBDBM121299(US8722896, (+/-)-2-Methyl-3-(N-methyl-indol- 4-ylm...)
Affinity DataKi:  7.32nM ΔG°:  -11.5kcal/moleT: 2°C. Assay description: An aequorin-based luminescent assay for calcium mobilization was used to measure mobilization of intracellular Ca2+ (Bullock et al., Mol Pharmacol 65...
In DepthDetails US Patent
TargetProkineticin receptor 2(Cricetulus griseus (Chinese hamster))
The Regents of The University of California
US Patent
LigandPNGBDBM121299(US8722896, (+/-)-2-Methyl-3-(N-methyl-indol- 4-ylm...)
Affinity DataKi:  7.60nM ΔG°:  -11.5kcal/moleT: 2°C. Assay description: An aequorin-based luminescent assay for calcium mobilization was used to measure mobilization of intracellular Ca2+ (Bullock et al., Mol Pharmacol 65...
In DepthDetails US Patent