BDBM121303 US8722896, (+/-)-2-Methyl-3-(N-methyl-indol- 7-ylmethylamino)-N-(9-chloro- 2,3,4,5-tetrahydro-1-benzoxepin- 7-ylmethyl)-N- isobutylpropanamide
SMILES CC(C)CN(Cc1cc(Cl)c2OCCCCc2c1)C(=O)C(C)CNCc1cccc2ccn(C)c12
InChI Key InChIKey=NSZMRDSEOSARHF-UHFFFAOYSA-N
Data  3 KI
  Tab Delimited (TSV)   2D SDfile   Computed 3D by Vconf -m prep SDfile
Find this compound or compounds like it in BindingDB:
Activity Spreadsheet -- Enzyme Inhibition Constant Data from BindingDB
Found 3 hits for monomerid = 121303
TargetProkineticin receptor 1(Cricetulus griseus (Chinese hamster))
The Regents of The University of California
US Patent
LigandPNGBDBM121303(US8722896, (+/-)-2-Methyl-3-(N-methyl-indol- 7-ylm...)
Affinity DataKi:  4.74nM ΔG°:  -11.8kcal/moleT: 2°C. Assay description: An aequorin-based luminescent assay for calcium mobilization was used to measure mobilization of intracellular Ca2+ (Bullock et al., Mol Pharmacol 65...
In DepthDetails US Patent
TargetProkineticin receptor 2(Cricetulus griseus (Chinese hamster))
The Regents of The University of California
US Patent
LigandPNGBDBM121303(US8722896, (+/-)-2-Methyl-3-(N-methyl-indol- 7-ylm...)
Affinity DataKi:  6.20nM ΔG°:  -11.6kcal/moleT: 2°C. Assay description: An aequorin-based luminescent assay for calcium mobilization was used to measure mobilization of intracellular Ca2+ (Bullock et al., Mol Pharmacol 65...
In DepthDetails US Patent
TargetProkineticin receptor 1(Cricetulus griseus (Chinese hamster))
The Regents of The University of California
US Patent
LigandPNGBDBM121303(US8722896, (+/-)-2-Methyl-3-(N-methyl-indol- 7-ylm...)
Affinity DataKi:  8.64nM ΔG°:  -11.4kcal/moleT: 2°C. Assay description: An aequorin-based luminescent assay for calcium mobilization was used to measure mobilization of intracellular Ca2+ (Bullock et al., Mol Pharmacol 65...
In DepthDetails US Patent