BDBM121310 US8722896, (-)-(3R)-1-(Indolin-7-ylmethyl)- N-(9-chloro-2,3,4,5-tetrahydro- 1-benzoxepin-7-ylmethyl)-N- isobutylpiperidine-3- carboxamide
SMILES CC(C)CN(Cc1cc(Cl)c2OCCCCc2c1)C(=O)C1CCCN(Cc2cccc3CCNc23)C1
InChI Key InChIKey=QCHMPSACYGRTML-UHFFFAOYSA-N
Data  2 KI
  Tab Delimited (TSV)   2D SDfile   Computed 3D by Vconf -m prep SDfile
Find this compound or compounds like it in BindingDB:
Activity Spreadsheet -- Enzyme Inhibition Constant Data from BindingDB
Found 2 hits for monomerid = 121310
TargetProkineticin receptor 2(Cricetulus griseus (Chinese hamster))
The Regents of The University of California
US Patent
LigandPNGBDBM121310(US8722896, (-)-(3R)-1-(Indolin-7-ylmethyl)- N-(9-c...)
Affinity DataKi:  3.94nM ΔG°:  -11.9kcal/moleT: 2°C. Assay description: An aequorin-based luminescent assay for calcium mobilization was used to measure mobilization of intracellular Ca2+ (Bullock et al., Mol Pharmacol 65...
In DepthDetails US Patent
TargetProkineticin receptor 1(Cricetulus griseus (Chinese hamster))
The Regents of The University of California
US Patent
LigandPNGBDBM121310(US8722896, (-)-(3R)-1-(Indolin-7-ylmethyl)- N-(9-c...)
Affinity DataKi:  4.60nM ΔG°:  -11.8kcal/moleT: 2°C. Assay description: An aequorin-based luminescent assay for calcium mobilization was used to measure mobilization of intracellular Ca2+ (Bullock et al., Mol Pharmacol 65...
In DepthDetails US Patent