BDBM122396 US8729078, I-1
SMILES Cn1cc(nc1C(N)=O)-c1cccc(c1CO)-n1ncc2cc(ccc2c1=O)C(C)(C)C
InChI Key InChIKey=WUQHLGSHROMNJK-UHFFFAOYSA-N
Data  1 IC50
  Tab Delimited (TSV)   2D SDfile   Computed 3D by Vconf -m prep SDfile
Find this compound or compounds like it in BindingDB:
Activity Spreadsheet -- Enzyme Inhibition Constant Data from BindingDB
Found 1 hit for monomerid = 122396
TargetTyrosine-protein kinase BTK(Homo sapiens (Human))
Hoffmann-La Roche
US Patent
LigandPNGBDBM122396(US8729078, I-1)
Affinity DataIC50:  50nMpH: 7.2Assay Description:Plates assayed are 96-well polypropylene (Greiner) and 96-well 1.2 μm hydrophilic PVDF filter plates (Millipore). Concentrations reported here a...
In DepthDetails US Patent