BDBM122432 US8729078, I-42
SMILES CC(C)(C)c1cc(F)c2c(cnn(-c3cccc(c3CO)-n3cc(C(N)=O)c4cncnc34)c2=O)c1
InChI Key InChIKey=AZSWDGZYTVLICY-UHFFFAOYSA-N
Data  1 IC50
  Tab Delimited (TSV)   2D SDfile   Computed 3D by Vconf -m prep SDfile
Find this compound or compounds like it in BindingDB:
Activity Spreadsheet -- Enzyme Inhibition Constant Data from BindingDB
Found 1 hit for monomerid = 122432
TargetTyrosine-protein kinase BTK(Homo sapiens (Human))
Hoffmann-La Roche
US Patent
LigandPNGBDBM122432(US8729078, I-42)
Affinity DataIC50:  7.32nMpH: 7.2Assay Description:Plates assayed are 96-well polypropylene (Greiner) and 96-well 1.2 μm hydrophilic PVDF filter plates (Millipore). Concentrations reported here a...
In DepthDetails US Patent