BDBM126566 US8772283, 10
SMILES NC1(CC(O)(C1)C1CC1)c1ccc(cc1)-c1nc2-c3cccc(F)c3OCn2c1-c1ccccc1
InChI Key InChIKey=MMUXGKIVENLORJ-UHFFFAOYSA-N
Data  2 IC50
  Tab Delimited (TSV)   2D SDfile   Computed 3D by Vconf -m prep SDfile
Find this compound or compounds like it in BindingDB:
Activity Spreadsheet -- Enzyme Inhibition Constant Data from BindingDB
Found 2 hits for monomerid = 126566
TargetRAC-beta serine/threonine-protein kinase(Homo sapiens (Human))
Taiho Pharmaceutical
US Patent
LigandPNGBDBM126566(US8772283, 10)
Affinity DataIC50:  1.40nMpH: 7.5Assay Description:Preparation of AKT1 and AKT2 and measurement of in vitro inhibitory activity of the above-mentioned compounds against AKT1 and AKT2 kinase activity w...
In DepthDetails US Patent
TargetRAC-alpha serine/threonine-protein kinase(Homo sapiens (Human))
Taiho Pharmaceutical
US Patent
LigandPNGBDBM126566(US8772283, 10)
Affinity DataIC50:  2.30nMpH: 7.5Assay Description:Preparation of AKT1 and AKT2 and measurement of in vitro inhibitory activity of the above-mentioned compounds against AKT1 and AKT2 kinase activity w...
In DepthDetails US Patent