BDBM128404 US8802695, 20
SMILES CCn1cc(Br)c2cnc(NC(=O)c3ccc(cc3)[C@@](C)(O)CO)cc12
InChI Key InChIKey=GNDQKBUOIUXIMO-IBGZPJMESA-N
Data  2 IC50
  Tab Delimited (TSV)   2D SDfile   Computed 3D by Vconf -m prep SDfile
Find this compound or compounds like it in BindingDB:
Activity Spreadsheet -- Enzyme Inhibition Constant Data from BindingDB
Found 2 hits for monomerid = 128404
TargetMitogen-activated protein kinase kinase kinase 5(Homo sapiens (Human))
Takeda Pharmaceutical
US Patent
LigandPNGBDBM128404(US8802695, 20)
Affinity DataIC50:  10nMpH: 7.3 T: 2°C. Assay description: The inhibitory properties of compounds to ASK1 may be determined using a white 384-well-plate format under the following reaction conditions: 25 nM A...
In DepthDetails US Patent
TargetMitogen-activated protein kinase kinase kinase 5(Homo sapiens (Human))
Takeda Pharmaceutical
US Patent
LigandPNGBDBM128404(US8802695, 20)
Affinity DataIC50:  2nMpH: 7.5 T: 2°C. Assay description: The test compounds (2.5 μL) dissolved in DMSO were added to wells containing 37.5 μL of the reaction solution (25 mM HEPES (pH 7.5), 10 mM ...
In DepthDetails US Patent