BDBM129356 US8802686, 14
SMILES CS(=O)(=O)c1ccc(Nc2ncc(c(OCCC(F)(F)F)n2)C(F)(F)F)cc1
InChI Key InChIKey=LOXABGFYQLXZMY-UHFFFAOYSA-N
Data  3 IC50
  Tab Delimited (TSV)   2D SDfile   Computed 3D by Vconf -m prep SDfile
Find this compound or compounds like it in BindingDB:
Activity Spreadsheet -- Enzyme Inhibition Constant Data from BindingDB
Found 3 hits for monomerid = 129356
TargetCyclin-dependent kinase 1(Homo sapiens (Human))
Bayer Intellectual Property
US Patent
LigandPNGBDBM129356(US8802686, 14)
Affinity DataIC50:  740nMpH: 8.0 T: 2°C. Assay description: CDK1/CycB (200 ng/measuring point) was incubated for 10 min at 22 C. in the presence of different concentrations of test substances (0 and within the...
In DepthDetails US Patent
TargetVascular endothelial growth factor receptor 2(Homo sapiens (Human))
Bayer Intellectual Property
US Patent
LigandPNGBDBM129356(US8802686, 14)
Affinity DataIC50: >1.00E+3nMpH: 5.5 T: 2°C. Assay description: VEGF receptor tyrosine kinase (90 ng/measuring point) was incubated for 10 min at 22 C. in the presence of different concentrations of test substance...
In DepthDetails US Patent
TargetCyclin-dependent kinase 2(Homo sapiens (Human))
Bayer Intellectual Property
US Patent
LigandPNGBDBM129356(US8802686, 14)
Affinity DataIC50:  94nMpH: 8.0 T: 2°C. Assay description: CDK2/CycE (50 mg/measuring point) was incubated for 10 min at 22 C. in the presence of different concentrations of test substances (0 uM, and within ...
In DepthDetails US Patent