BDBM12943 4-sulfamoyl-N-[(1-{[(2R,3S,4S,5R,6S)-3,4,5-trihydroxy-6-methoxyoxan-2-yl]methyl}-1H-1,2,3-triazol-4-yl)methyl]benzamide::CHEMBL410510::Glycoconjugate Benzene Sulfonamide 2gg::Methyl 6-[4-({[aminosulfonyl)benzoyl]amino}methyl)-1H-1,2,3-triazol-1-yl]-6-deoxy-alpha-D-glucopyranoside
SMILES CO[C@H]1O[C@H](Cn2cc(CNC(=O)c3ccc(cc3)S(N)(=O)=O)nn2)[C@@H](O)[C@H](O)[C@H]1O
InChI Key InChIKey=CUIHYXWFVVADCJ-GAGVYUBLSA-N
Data  5 KI
  Tab Delimited (TSV)   2D SDfile   Computed 3D by Vconf -m prep SDfile
Find this compound or compounds like it in BindingDB:
Activity Spreadsheet -- Enzyme Inhibition Constant Data from BindingDB
Found 5 hits for monomerid = 12943
TargetCarbonic anhydrase 12(Homo sapiens (Human))
Griffith University
Curated by ChEMBL
LigandPNGBDBM12943(4-sulfamoyl-N-[(1-{[(2R,3S,4S,5R,6S)-3,4,5-trihydr...)
Affinity DataKi:  3.90nM. Assay description: Inhibition of human recombinant CA12 by CO2 hydration assay
In DepthDetails ArticlePubMed
TargetCarbonic anhydrase 14(Homo sapiens (Human))
Griffith University
Curated by ChEMBL
LigandPNGBDBM12943(4-sulfamoyl-N-[(1-{[(2R,3S,4S,5R,6S)-3,4,5-trihydr...)
Affinity DataKi:  78nM. Assay description: Inhibition of human recombinant CA14 by CO2 hydration assay
In DepthDetails ArticlePubMed
TargetCarbonic anhydrase 2(Homo sapiens (Human))
Griffith University
LigandPNGBDBM12943(4-sulfamoyl-N-[(1-{[(2R,3S,4S,5R,6S)-3,4,5-trihydr...)
Affinity DataKi:  90nM. Assay description: An Applied Photophysics stopped-flow instrument has been used for assaying the CA-catalyzed CO2 hydration activity. Phenol red has been used as indic...
In DepthDetails ArticlePubMed
TargetCarbonic anhydrase 9(Homo sapiens (Human))
Griffith University
LigandPNGBDBM12943(4-sulfamoyl-N-[(1-{[(2R,3S,4S,5R,6S)-3,4,5-trihydr...)
Affinity DataKi:  204nM. Assay description: An Applied Photophysics stopped-flow instrument has been used for assaying the CA-catalyzed CO2 hydration activity. Phenol red has been used as indic...
In DepthDetails ArticlePubMed
TargetCarbonic anhydrase 1(Homo sapiens (Human))
Griffith University
LigandPNGBDBM12943(4-sulfamoyl-N-[(1-{[(2R,3S,4S,5R,6S)-3,4,5-trihydr...)
Affinity DataKi:  9.30E+3nM. Assay description: An Applied Photophysics stopped-flow instrument has been used for assaying the CA-catalyzed CO2 hydration activity. Phenol red has been used as indic...
In DepthDetails ArticlePubMed