BDBM130659 US8822447, 168::US9771375, Example 168
SMILES CSc1nn(-c2ccccc2)c2cc(ccc12)C(=O)C(=O)N1CCNCC1
InChI Key InChIKey=RHEHFXCHZCUASM-UHFFFAOYSA-N
Data  2 IC50
  Tab Delimited (TSV)   2D SDfile   Computed 3D by Vconf -m prep SDfile
Find this compound or compounds like it in BindingDB:
Activity Spreadsheet -- Enzyme Inhibition Constant Data from BindingDB
Found 2 hits for monomerid = 130659
TargetKetohexokinase(Homo sapiens (Human))
Janssen Pharmaceutica
US Patent
LigandPNGBDBM130659(US8822447, 168 | US9771375, Example 168)
Affinity DataIC50:  4.12E+3nM. Assay description: An enzymatic assay was developed to measure KHK-mediated conversion of D-fructose to Fructose-1-P (F-1-P) using High Throughput Mass Spectroscopy (HT...
Ligand InfoPC cidPC sid
In DepthDetails US Patent
TargetKetohexokinase(Homo sapiens (Human))
Janssen Pharmaceutica
US Patent
LigandPNGBDBM130659(US8822447, 168 | US9771375, Example 168)
Affinity DataIC50:  4.12E+3nMT: 2°C. Assay description: An enzymatic assay was developed to measure KHK-mediated conversion of D-fructose to Fructose-1-P (F-1-P) using High Throughput Mass Spectroscopy (HT...
Ligand InfoPC cidPC sid
In DepthDetails US Patent