BDBM130709 US8822448, 17
SMILES Cc1cc2[nH]c(=O)c3cnn(C4CCOCC4)c3c2cc1C(=O)N1CCN(CC1)c1ccccn1
InChI Key InChIKey=ZOAANKAHKASUSA-UHFFFAOYSA-N
Data  1 IC50
  Tab Delimited (TSV)   2D SDfile   Computed 3D by Vconf -m prep SDfile
Find this compound or compounds like it in BindingDB:
Activity Spreadsheet -- Enzyme Inhibition Constant Data from BindingDB
Found 1 hit for monomerid = 130709
TargetHigh affinity cGMP-specific 3',5'-cyclic phosphodiesterase 9A(Rattus norvegicus (Rat))
Astellas Pharma
US Patent
LigandPNGBDBM130709(US8822448, 17)
Affinity DataIC50:  2.10nMpH: 8.0Assay Description:The PDE9-inhibiting activity was measured by the following method. That is, to a buffer solution containing tris(hydroxymethyl)aminomethane-hydrochlo...
In DepthDetails US Patent