BDBM130756 US8822448, 179
SMILES COCCCN1CCN(C[C@@H]1C)C(=O)c1cc2c3n(ncc3c(=O)[nH]c2cc1C)C1CCC1
InChI Key InChIKey=VISJRIAOCXZYMQ-KRWDZBQOSA-N
Data  1 IC50
  Tab Delimited (TSV)   2D SDfile   Computed 3D by Vconf -m prep SDfile
Find this compound or compounds like it in BindingDB:
Activity Spreadsheet -- Enzyme Inhibition Constant Data from BindingDB
Found 1 hit for monomerid = 130756
TargetHigh affinity cGMP-specific 3',5'-cyclic phosphodiesterase 9A(Rattus norvegicus (Rat))
Astellas Pharma
US Patent
LigandPNGBDBM130756(US8822448, 179)
Affinity DataIC50:  6.80nMpH: 8.0Assay Description:The PDE9-inhibiting activity was measured by the following method. That is, to a buffer solution containing tris(hydroxymethyl)aminomethane-hydrochlo...
In DepthDetails US Patent