BDBM132869 US8846746, 139
SMILES CCC(F)(F)c1cccc(c1)-c1cc(NC(=O)[C@H]2CNC(=O)C2)nn1-c1cccc(Cl)c1
InChI Key InChIKey=ZLWLPYCIPZFAAQ-OAHLLOKOSA-N
Data  1 IC50
  Tab Delimited (TSV)   2D SDfile   Computed 3D by Vconf -m prep SDfile
Find this compound or compounds like it in BindingDB:
Activity Spreadsheet -- Enzyme Inhibition Constant Data from BindingDB
Found 1 hit for monomerid = 132869
TargetSodium/glucose cotransporter 1(Homo sapiens (Human))
Japan Tobacco
US Patent
LigandPNGBDBM132869(US8846746, 139)
Affinity DataIC50:  1.70nMT: 2°C. Assay description: The stable cell line expressing human SGLT1 was seeded at 5x104 cells/well on BioCoat Poly-D-Lysine 96 well plate with Lid (Becton Dickinson and Comp...
In DepthDetails US Patent