BDBM13474 2,2,2-trifluoro-N-[(1S)-1-[5-(trifluoromethyl)-1H-1,3-benzodiazol-2-yl]-2-{4-[(5S)-1,1,3-trioxo-1,2-thiazolidin-5-yl]phenyl}ethyl]acetamide::Isothiazolidinone (IZD) deriv. 3::N-{(1S)-2-[4-(1,1-dioxido-3-oxoisothiazolidin-5-yl)phenyl]-1-[5-(trifluoromethyl)-1H-benzimidazol-2-yl]ethyl}-2,2,2-trifluoroacetamide
SMILES FC(F)(F)C(=O)N[C@@H](Cc1ccc(cc1)[C@@H]1CC(=O)NS1(=O)=O)c1nc2ccc(cc2[nH]1)C(F)(F)F
InChI Key InChIKey=ZQCICORKZRLKMU-HOTGVXAUSA-N
Data  1 IC50
PDB links: 1 PDB ID matches this monomer.
  Tab Delimited (TSV)   2D SDfile   Computed 3D by Vconf -m prep SDfile
Find this compound or compounds like it in BindingDB:
Activity Spreadsheet -- Enzyme Inhibition Constant Data from BindingDB
Found 1 hit for monomerid = 13474
LigandPNGBDBM13474(2,2,2-trifluoro-N-[(1S)-1-[5-(trifluoromethyl)-1H-...)
Affinity DataIC50:  110nMpH: 7.0 T: 2°C. Assay description: The activity of PTP1B enzyme was assayed with 4-nitrophenyl phosphate (pNPP) as substrate. Rate of formation of the phenolate ion was monitored at 41...