BDBM13489 Isothiazolidinone (IZD) deriv. 25::N-[(1S)-1-(1H-1,3-benzodiazol-2-yl)-2-[4-(1,1,3-trioxo-1,2-thiazolidin-5-yl)phenyl]ethyl]-2,2-difluoropropanamide
SMILES CC(F)(F)C(=O)N[C@@H](Cc1ccc(cc1)C1CC(=O)NS1(=O)=O)c1nc2ccccc2[nH]1
InChI Key InChIKey=NZWOFAGWSHSSRZ-BHWOMJMDSA-N
Data  1 IC50
  Tab Delimited (TSV)   2D SDfile   Computed 3D by Vconf -m prep SDfile
Find this compound or compounds like it in BindingDB:
Activity Spreadsheet -- Enzyme Inhibition Constant Data from BindingDB
Found 1 hit for monomerid = 13489
LigandPNGBDBM13489(Isothiazolidinone (IZD) deriv. 25 | N-[(1S)-1-(1H-...)
Affinity DataIC50:  300nM. Assay description: The activity of PTP1B enzyme was assayed with 4-nitrophenyl phosphate (pNPP) as substrate. Rate of formation of the phenolate ion was monitored at 41...
In DepthDetails ArticlePubMed