BDBM135829 US8853215, 34
SMILES CC(C)(C)c1ccccc1N1CCN(CC1)C(=O)c1ccc(cc1)C(O)=O
InChI Key InChIKey=PTAMSLYHEHTWRZ-UHFFFAOYSA-N
Data  1 IC50
  Tab Delimited (TSV)   2D SDfile   Computed 3D by Vconf -m prep SDfile
Find this compound or compounds like it in BindingDB:
Activity Spreadsheet -- Enzyme Inhibition Constant Data from BindingDB
Found 1 hit for monomerid = 135829
TargetRetinol-binding protein 4(Homo sapiens (Human))
Takeda Pharmaceutical
US Patent
LigandPNGBDBM135829(US8853215, 34)
Affinity DataIC50:  480nMpH: 7.5 T: 2°C. Assay description: Streptavidin (20 ul) (10 ug/ml Streptavidin type II (Wako Pure Chemical Industries, Ltd.), 10 mM Tris-HCl (pH 7.5), 10 mM NaCl) was added to a 384 we...
In DepthDetails US Patent