BDBM136828 US10231967, Example 64::US8865911, 64::US9918985, Example 64
SMILES CCC1=NC2(N=C1N)c1cc(Br)ccc1C[C@@]21CC[C@@H](CC1)OC
InChI Key InChIKey=RZZDAMQILXHFNA-FGWLZILTSA-N
Data  4 IC50
  Tab Delimited (TSV)   2D SDfile   Computed 3D by Vconf -m prep SDfile
Find this compound or compounds like it in BindingDB:
Activity Spreadsheet -- Enzyme Inhibition Constant Data from BindingDB
Found 1 hit for monomerid = 136828
TargetBeta-secretase 1(Homo sapiens (Human))
Astrazeneca
US Patent
LigandPNGBDBM136828(US10231967, Example 64 | US8865911, 64 | US9918985...)
Affinity DataIC50:  401nMpH: 9.2Assay Description:The beta-secretase enzyme used in the TR-FRET is prepared as follows: The cDNA for the soluble part of the human beta-Secretase (AA 1-AA 460) was clo...
In DepthDetails US Patent