BDBM13808 (2S)-N-[(1S)-1-carbamoyl-2-[4-(1,1,3-trioxo-1,2-thiazolidin-5-yl)phenyl]ethyl]-3-phenyl-2-(phenylformamido)propanamide::IZD 3
SMILES NC(=O)[C@H](Cc1ccc(cc1)C1CC(=O)NS1(=O)=O)NC(=O)[C@H](Cc1ccccc1)NC(=O)c1ccccc1
InChI Key InChIKey=ZSFPNCCMRAHJSA-NTZARQNWSA-N
Data  2 IC50
PDB links: 1 PDB ID matches this monomer.
  Tab Delimited (TSV)   2D SDfile   Computed 3D by Vconf -m prep SDfile
Find this compound or compounds like it in BindingDB:
Activity Spreadsheet -- Enzyme Inhibition Constant Data from BindingDB
Found 2 hits for monomerid = 13808
LigandPNGBDBM13808((2S)-N-[(1S)-1-carbamoyl-2-[4-(1,1,3-trioxo-1,2-th...)
Affinity DataIC50:  1.50E+5nM. Assay description: Inhibition of Homo sapiens (human) PTP1B expressed in Escherichia coli using PNPP as substrate
LigandPNGBDBM13808((2S)-N-[(1S)-1-carbamoyl-2-[4-(1,1,3-trioxo-1,2-th...)
Affinity DataIC50:  185nMpH: 7.0 T: 2°C. Assay description: The activity of PTP1B enzyme was assayed with 4-nitrophenyl phosphate (pNPP) as substrate. Rate of formation of the phenolate ion was monitored at 41...