BDBM138589 US8877741, 1.67
SMILES C[C@H](NC(C)=O)c1ccc(OC2CCN(C2)c2ncc(OC3CC3)cc2F)cc1
InChI Key InChIKey=CTNXSWITUPSSNE-KTQQKIMGSA-N
Data  1 IC50
  Tab Delimited (TSV)   2D SDfile   Computed 3D by Vconf -m prep SDfile
Find this compound or compounds like it in BindingDB:
Activity Spreadsheet -- Enzyme Inhibition Constant Data from BindingDB
Found 1 hit for monomerid = 138589
TargetAcetyl-CoA carboxylase 2(Homo sapiens (Human))
Boehringer Ingelheim International
US Patent
LigandPNGBDBM138589(US8877741, 1.67)
Affinity DataIC50:  463nMpH: 7.5Assay Description:Malonyl CoA formation by acetyl CoA carboxylases is stoichometrically linked to the consumption of ATP. ACC2 activity is measured in a NADH-linked ki...
In DepthDetails US Patent