BDBM13931 (2S)-N-[(2S,3R)-4-{[(8S,11S)-8-[(2R)-butan-2-yl]-7,10-dioxo-2-oxa-6,9-diazabicyclo[11.2.2]heptadeca-1(15),13,16-trien-11-yl]amino}-3-hydroxy-1-(4-hydroxyphenyl)butan-2-yl]-3-methyl-2-(2-oxopyrrolidin-1-yl)butanamide::Macrocyclic Peptidomimetic Inhibitor 5::Peptidomimetic inhibitor 5
SMILES CCC(C)[C@@H]1NC(=O)[C@H](Cc2ccc(OCCCNC1=O)cc2)NC[C@@H](O)[C@H](Cc1ccc(O)cc1)NC(=O)[C@H](C(C)C)N1CCCC1=O
InChI Key InChIKey=WGWWDGLTNADWNS-KKZGTGSDSA-N
Data  1 KI  1 IC50
PDB links: 1 PDB ID matches this monomer.
  Tab Delimited (TSV)   2D SDfile   Computed 3D by Vconf -m prep SDfile
Find this compound or compounds like it in BindingDB:
Activity Spreadsheet -- Enzyme Inhibition Constant Data from BindingDB
Found 2 hits for monomerid = 13931
TargetDimer of Gag-Pol polyprotein [501-599,Q508K,L534I,L564I,C568A,C596A](Human immunodeficiency virus type 1)
University of Queensland
LigandPNGBDBM13931((2S)-N-[(2S,3R)-4-{[(8S,11S)-8-[(2R)-butan-2-yl]-7...)
Affinity DataKi:  1.80nM ΔG°:  -12.4kcal/molepH: 6.5 T: 2°C. Assay description: he Ki values were determined using fluorogenic substrate, 2-(aminobenzoyl)-Thr-Ile-Nle-Phe(p-NO2)-Gln-ArgNH2. A standard curve relating changes in fl...
In DepthDetails ArticlePubMed
TargetDimer of Gag-Pol polyprotein [489-587](Human immunodeficiency virus type 1)
University of Pennsylvania
LigandPNGBDBM13931((2S)-N-[(2S,3R)-4-{[(8S,11S)-8-[(2R)-butan-2-yl]-7...)
Affinity DataIC50:  10nMpH: 5.5 T: 2°C. Assay description: Sensitivity of HIV-1 protease activity to protease inhibitors was determined by a peptide substrate cleavage assay. Protease products were analyzed o...
In DepthDetails ArticlePubMed