BDBM140382 US10947243, Example 107::US8912173, 107::US9914735, Example 107
SMILES C[C@@H](Oc1cc(cc2ncccc12)-c1ccc2nc(C)nc(C)c2c1)[C@H]1CNC(=O)C1
InChI Key InChIKey=HYXFMJAJQAKJSH-DNVCBOLYSA-N
Data  9 IC50
  Tab Delimited (TSV)   2D SDfile   Computed 3D by Vconf -m prep SDfile
Find this compound or compounds like it in BindingDB:
Activity Spreadsheet -- Enzyme Inhibition Constant Data from BindingDB
Found 9 hits for monomerid = 140382
TargetTyrosine-protein kinase SYK(Homo sapiens (Human))
Boehringer Ingelheim International
US Patent
LigandPNGBDBM140382(US10947243, Example 107 | US8912173, 107 | US99147...)
Affinity DataIC50:  4.90nMpH: 7.5 T: 2°C. Assay description: Recombinant human Syk (amino acids 342-635) was expressed as a fusion protein with an N-terminal GST tag, affinity-purified and deep-frozen at a conc...
In DepthDetails US Patent
TargetTyrosine-protein kinase SYK(Homo sapiens (Human))
Boehringer Ingelheim International
US Patent
LigandPNGBDBM140382(US10947243, Example 107 | US8912173, 107 | US99147...)
Affinity DataIC50:  9nM. Assay description: Human GSK3beta (expressed and prified from SF21 cells) is obtained from the University Dundee/Scotland (Dr. James Hastie—Dept. of Biochemistry) ...
In DepthDetails US Patent
TargetAurora kinase B(Homo sapiens (Human))
Boehringer Ingelheim International
US Patent
LigandPNGBDBM140382(US10947243, Example 107 | US8912173, 107 | US99147...)
Affinity DataIC50:  1.82E+3nM. Assay description: Recombinant human Aurora B (amino acids 1-344, clone number DU1773, Molecular weight 40.2 kDa, University of Dundee) was expressed as a fusion protei...
In DepthDetails US Patent
TargetReceptor-type tyrosine-protein kinase FLT3(Homo sapiens (Human))
Boehringer Ingelheim International
US Patent
LigandPNGBDBM140382(US10947243, Example 107 | US8912173, 107 | US99147...)
Affinity DataIC50:  1.76E+3nM. Assay description: FLT3 is obtained from Invitrogen in 50 mM Tris (pH7.5); 100 mM NaCl; 0.05 mM EDTA, 0.05% NP-40, 2 mM DTT; 50% Glycerol # PV3182; Lot 286671; sequence...
In DepthDetails US Patent
TargetGlycogen synthase kinase-3 beta(Homo sapiens (Human))
Boehringer Ingelheim International
US Patent
LigandPNGBDBM140382(US10947243, Example 107 | US8912173, 107 | US99147...)
Affinity DataIC50: >1.00E+4nM. Assay description: FLT3 is obtained from Invitrogen in 50 mM Tris (pH7.5); 100 mM NaCl; 0.05 mM EDTA, 0.05% NP-40, 2 mM DTT; 50% Glycerol # PV3182; Lot 286671; sequence...
In DepthDetails US Patent
TargetTyrosine-protein kinase SYK [342-635](Homo sapiens (Human))
Boehringer Ingelheim International
US Patent
LigandPNGBDBM140382(US10947243, Example 107 | US8912173, 107 | US99147...)
Affinity DataIC50:  9nM. Assay description: Human GSK3beta (expressed and prified from SF21 cells) is obtained from the University Dundee/Scotland (Dr. James Hastie—Dept. of Biochemistry) in 50...
In DepthDetails US Patent
TargetAurora kinase B(Homo sapiens (Human))
Boehringer Ingelheim International
US Patent
LigandPNGBDBM140382(US10947243, Example 107 | US8912173, 107 | US99147...)
Affinity DataIC50:  1.82E+3nM. Assay description: Recombinant human Syk (amino acids 342-635) was expressed as a fusion protein with an N-terminal GST tag, affinity-purified and deep-frozen at a conc...
In DepthDetails US Patent
TargetReceptor-type tyrosine-protein kinase FLT3(Homo sapiens (Human))
Boehringer Ingelheim International
US Patent
LigandPNGBDBM140382(US10947243, Example 107 | US8912173, 107 | US99147...)
Affinity DataIC50:  1.76E+3nM. Assay description: Recombinant human Aurora B (amino acids 1-344, clone number DU1773, Molecular weight 40.2 kDa, University of Dundee) was expressed as a fusion protei...
In DepthDetails US Patent
TargetGlycogen synthase kinase-3 beta(Homo sapiens (Human))
Boehringer Ingelheim International
US Patent
LigandPNGBDBM140382(US10947243, Example 107 | US8912173, 107 | US99147...)
Affinity DataIC50: >1.00E+4nM. Assay description: Human GSK3beta (expressed and prified from SF21 cells) is obtained from the University Dundee/Scotland (Dr. James Hastie—Dept. of Biochemistry) ...
In DepthDetails US Patent