BDBM145137 US8952157, 328::US9303025, 328
SMILES CCN1CCOCC1COc1ccc(cc1[N+]([O-])=O)S(=O)(=O)NC(=O)c1ccc(cc1Oc1cc2cc[nH]c2cc1F)N1CCN(CC2=C(CC(C)(C)CC2)c2ccc(Cl)cc2)CC1
InChI Key
Data  2 KI
  Tab Delimited (TSV)   2D SDfile   Computed 3D by Vconf -m prep SDfile
Find this compound or compounds like it in BindingDB:
Activity Spreadsheet -- Enzyme Inhibition Constant Data from BindingDB
Found 2 hits for monomerid = 145137
TargetApoptosis regulator Bcl-2(Homo sapiens (Human))
Abbvie
US Patent
LigandPNGBDBM145137(US8952157, 328 | US9303025, 328)
Affinity DataKi:  0.0680nM ΔG°:  -13.9kcal/moleT: 2°C. Assay description: Representative compounds were serially diluted in dimethyl sulfoxide (DMSO) starting at 50 μM (2× starting concentration; 10% DMSO) and 10 μ...
In DepthDetails US Patent
TargetApoptosis regulator Bcl-2(Homo sapiens (Human))
Abbvie
US Patent
LigandPNGBDBM145137(US8952157, 328 | US9303025, 328)
Affinity DataKi:  0.0680nM ΔG°:  -13.9kcal/moleT: 2°C. Assay description: Representative compounds were serially diluted in dimethyl sulfoxide (DMSO) starting at 50 uM (2x starting concentration; 10% DMSO) and 10 uL were tr...
In DepthDetails US Patent